Target
Rho-related GTP-binding protein RhoC
Ligand
BDBM50481341
Substrate
Meas. Tech.
ChEMBL_604487 (CHEMBL1072732)
IC50
>100000±n/a nM
Citation
 Evelyn, CRBell, JLRyu, JGWade, SMKocab, AHarzdorf, NLShowalter, HDNeubig, RRLarsen, SD Design, synthesis and prostate cancer cell-based studies of analogs of the Rho/MKL1 transcriptional pathway inhibitor, CCG-1423. Bioorg Med Chem Lett 20:665-72 (2010)  
Target
Name:
Rho-related GTP-binding protein RhoC
Synonyms:
ARH9 RHOC Rho cDNA clone 9 | Rho-related GTP-binding protein RhoC
Type:
PROTEIN
Mol. Mass.:
22006.13
Organism:
Homo sapiens
Description:
ChEMBL_117031
Residue:
193
  
Inhibitor
Name:
BDBM50481341
Synonyms:
CHEMBL591079
Type:
Small organic molecule
Emp. Form.:
C15H13ClN2O3
Mol. Mass.:
304.728
SMILES:
Clc1ccc(NC(=O)CONC(=O)c2ccccc2)cc1
: