Target
Peptidyl-prolyl cis-trans isomerase NIMA-interacting 1
Ligand
BDBM50481980
Substrate
Meas. Tech.
ChEMBL_624078 (CHEMBL1103409)
Kd
170±n/a nM
Citation
 Liu, TLiu, YKao, HYPei, D Membrane permeable cyclic peptidyl inhibitors against human Peptidylprolyl Isomerase Pin1. J Med Chem 53:2494-501 (2010)  
Target
Name:
Peptidyl-prolyl cis-trans isomerase NIMA-interacting 1
Synonyms:
PIN1 PPIase Pin1 | Peptidyl-prolyl cis-trans isomerase NIMA-interacting 1
Type:
PROTEIN
Mol. Mass.:
18248.11
Organism:
Homo sapiens (Human)
Description:
ChEMBL_1502595
Residue:
163
  
Inhibitor
Name:
BDBM50481980
Synonyms:
CHEMBL1089627
Type:
Small organic molecule
Emp. Form.:
C64H108N29O15P
Mol. Mass.:
1554.7014
SMILES:
[H][C@@]12CCCCN1C(=O)[C@]([H])(NC(=O)[C@@H](CCCNC(N)=N)NC(=O)[C@@H](CCCNC(N)=N)NC(=O)[C@H](CCC(N)=O)NC(=O)[C@@H](CCCNC(N)=N)NC(=O)[C@@H](CCCNC(N)=N)NC(=O)[C@@H](CCCNC(N)=N)NC(=O)[C@@H](CCCNC(N)=N)NC(=O)[C@H](Cc1ccc3ccccc3c1)NC2=O)[C@@H](C)OP(O)(O)=O
: