Target
Stromelysin-3
Ligand
BDBM50482226
Substrate
Meas. Tech.
ChEMBL_638696 (CHEMBL1168920)
IC50
2500000±n/a nM
Citation
 Abdel-Mohsen, HTRagab, FARamla, MMEl Diwani, HI Novel benzimidazole-pyrimidine conjugates as potent antitumor agents. Eur J Med Chem 45:2336-44 (2010)  
Target
Name:
Stromelysin-3
Synonyms:
MMP11_MOUSE Mmp11
Type:
PROTEIN
Mol. Mass.:
55452.62
Organism:
Mus musculus
Description:
ChEMBL_106453
Residue:
492
  
Inhibitor
Name:
BDBM50482226
Synonyms:
CHEMBL1164111
Type:
Small organic molecule
Emp. Form.:
C25H18N6S
Mol. Mass.:
434.516
SMILES:
N#Cc1c(Nc2ccccc2)nc(SCc2nc3ccccc3[nH]2)nc1-c1ccccc1
: