Target
Integrin alpha-3/beta-3
Ligand
BDBM50482400
Substrate
Meas. Tech.
ChEMBL_643922 (CHEMBL1211821)
IC50
2.6±n/a nM
Citation
 Krysko, AAKrysko, OLKabanova, TAAndronati, SAKabanov, VM Derivatives of tetrahydroisoquinoline: synthesis and initial evaluation of novel non-peptide antagonists of the alpha(IIb)beta(3)-integrin. Bioorg Med Chem Lett 20:4444-6 (2010)  
Target
Name:
Integrin alpha-3/beta-3
Synonyms:
Type:
Mol. Mass.:
Description:
ASSAY_ID of ChEMBL is 643921
Components:
This complex has 2 components.
Component 1
Name:
Integrin beta-3
Synonyms:
CD_antigen=CD61 GPIIIa ITGB3 Platelet membrane glycoprotein IIIa
Type:
Protein
Mol. Mass.:
87038.91
Organism:
Homo sapiens (Human)
Description:
P05106
Residue:
788
  
Component 2
Name:
Integrin alpha-3
Synonyms:
CD49 antigen-like family member C FRP-2 Galactoprotein B3 ITGA3 Integrin alpha-3 light chain VLA-3 alpha chain
Type:
PROTEIN
Mol. Mass.:
116614.45
Organism:
Homo sapiens (Human)
Description:
ChEMBL_559748
Residue:
1051
  
Inhibitor
Name:
BDBM50482400
Synonyms:
CHEMBL1209622
Type:
Small organic molecule
Emp. Form.:
C22H25N3O5
Mol. Mass.:
411.451
SMILES:
COc1ccc(cc1)C(CC(O)=O)NC(=O)CCC(=O)Nc1ccc2CNCc2c1
: