Target
Replicase polyprotein 1ab
Ligand
BDBM50483056
Substrate
Meas. Tech.
ChEMBL_685004 (CHEMBL1286522)
IC50
49600±n/a nM
Citation
 Ryu, YBJeong, HJKim, JHKim, YMPark, JYKim, DNguyen, TTPark, SJChang, JSPark, KHRho, MCLee, WS Biflavonoids from Torreya nucifera displaying SARS-CoV 3CL(pro) inhibition. Bioorg Med Chem 18:7940-7 (2010)  
Target
Name:
Replicase polyprotein 1ab
Synonyms:
3C-like proteinase 3C-like proteinase (SARS-CoV 3Cpro) 3CLp GFL Guanine-N7 methyltransferase Helicase Leader protein Non-structural protein 10 Non-structural protein 3 Non-structural protein 6 Non-structural protein 8 ORF1ab polyprotein PL2-PRO Pol R1AB_SARS RdRp SARS coronavirus main proteinase nsp1 nsp12 nsp14 nsp16 nsp3 nsp5 nsp7 nsp9 pp1ab | rep
Type:
Protein
Mol. Mass.:
790250.81
Organism:
Human SARS coronavirus (SARS-CoV) (Severe acute respiratory syndrome coronavirus)
Description:
P0C6X7
Residue:
7073
  
Inhibitor
Name:
BDBM50483056
Synonyms:
CHEBI:78274 acs.jmedchem.1c00409_ST.703
Type:
Small organic molecule
Emp. Form.:
C20H30O
Mol. Mass.:
286.4516
SMILES:
[H][C@@]12CCc3cc(C(C)C)c(O)cc3[C@@]1(C)CCCC2(C)C
: