Target
Phenylethanolamine N-methyltransferase
Ligand
BDBM50028816
Substrate
Meas. Tech.
ChEBML_152416
IC50
57000±n/a nM
Citation
 Vincek, WCAldrich, CSBorchardt, RTGrunewald, GL Importance of the aromatic ring in adrenergic amines. 5. Nonaromatic analogues of phenylethanolamine as inhibitors of phenylethanolamine N-methyltransferase: role of hydrophobic and steric interactions. J Med Chem 24:7-12 (1981)  
Target
Name:
Phenylethanolamine N-methyltransferase
Synonyms:
Noradrenaline N-methyltransferase PNMT_BOVIN | PNMTase
Type:
Enzyme
Mol. Mass.:
30916.97
Organism:
Bos taurus (bovine)
Description:
Residue:
283
  
Inhibitor
Name:
BDBM50028816
Synonyms:
2-Amino-1-cycloocta-1,7-dienyl-ethanol | CHEMBL278921
Type:
Small organic molecule
Emp. Form.:
C10H17NO
Mol. Mass.:
167.2481
SMILES:
NCC(O)/C1=C/CCCC/C=C\1
: