Target
Phenylethanolamine N-methyltransferase
Ligand
BDBM50028785
Substrate
Meas. Tech.
ChEBML_152416
IC50
14000±n/a nM
Citation
 Vincek, WCAldrich, CSBorchardt, RTGrunewald, GL Importance of the aromatic ring in adrenergic amines. 5. Nonaromatic analogues of phenylethanolamine as inhibitors of phenylethanolamine N-methyltransferase: role of hydrophobic and steric interactions. J Med Chem 24:7-12 (1981)  
Target
Name:
Phenylethanolamine N-methyltransferase
Synonyms:
Noradrenaline N-methyltransferase PNMT_BOVIN | PNMTase
Type:
Enzyme
Mol. Mass.:
30916.97
Organism:
Bos taurus (bovine)
Description:
Residue:
283
  
Inhibitor
Name:
BDBM50028785
Synonyms:
2-Amino-1-cyclohexyl-ethanol CHEMBL18970
Type:
Small organic molecule
Emp. Form.:
C8H17NO
Mol. Mass.:
143.2267
SMILES:
NCC(O)C1CCCCC1
: