Target
Reverse transcriptase
Ligand
BDBM99893
Substrate
Meas. Tech.
ChEMBL_758401 (CHEMBL1811267)
IC50
6600±n/a nM
Citation
 Bode, MLGravestock, DMoleele, SSvan der Westhuyzen, CWPelly, SCSteenkamp, PAHoppe, HCKhan, TNkabinde, LA Imidazo[1,2-a]pyridin-3-amines as potential HIV-1 non-nucleoside reverse transcriptase inhibitors. Bioorg Med Chem 19:4227-37 (2011)  
Target
Name:
Reverse transcriptase
Synonyms:
Type:
Protein
Mol. Mass.:
29598.37
Organism:
Human immunodeficiency virus 1
Description:
Q9WKE8
Residue:
254
  
Inhibitor
Name:
BDBM99893
Synonyms:
US8501767, 96
Type:
Small organic molecule
Emp. Form.:
C20H19ClN4
Mol. Mass.:
350.845
SMILES:
Clc1ccccc1-c1nc2ccc(cn2c1NC1CCCCC1)C#N
: