Target
Serine/threonine-protein kinase B-raf
Ligand
BDBM333480
Substrate
Meas. Tech.
ChEMBL_766931 (CHEMBL1828156)
IC50
36±n/a nM
Citation
 Holladay, MWCampbell, BTRowbottom, MWChao, QSprankle, KGLai, AGAbraham, SSetti, EFaraoni, RTran, LArmstrong, RCGunawardane, RNGardner, MFCramer, MDGitnick, DAtor, MADorsey, BDRuggeri, BRWilliams, MBhagwat, SSJames, J 4-Quinazolinyloxy-diaryl ureas as novel BRAFV600E inhibitors. Bioorg Med Chem Lett 21:5342-6 (2011)  
Target
Name:
Serine/threonine-protein kinase B-raf
Synonyms:
B-RAF B-Raf proto-oncogene serine/threonine-protein kinase BRAF1 RAFB1 v-Raf murine sarcoma viral oncogene homolog B1
Type:
Serine/threonine-protein kinase
Mol. Mass.:
84446.00
Organism:
Homo sapiens (Human)
Description:
P15056
Residue:
766
  
Inhibitor
Name:
BDBM333480
Synonyms:
1-(5-tert- butylisoxazol- 3-yl)-3-(3- (7-methoxy- 6-(3- morpholino- propoxy) quinazolin-4- yloxy)phenyl) urea | US9730937, Example 22
Type:
Small organic molecule
Emp. Form.:
C30H36N6O6
Mol. Mass.:
576.6434
SMILES:
COc1cc2ncnc(Oc3cccc(NC(=O)Nc4cc(on4)C(C)(C)C)c3)c2cc1OCCCN1CCOCC1
: