Target
Focal adhesion kinase 1
Ligand
BDBM50484315
Substrate
Meas. Tech.
ChEMBL_772373 (CHEMBL1838972)
EC50
37300±n/a nM
Citation
 Sun, JYang, YSLi, WZhang, YBWang, XLTang, JFZhu, HL Synthesis, biological evaluation and molecular docking studies of 1,3,4-thiadiazole derivatives containing 1,4-benzodioxan as potential antitumor agents. Bioorg Med Chem Lett 21:6116-21 (2011)  
Target
Name:
Focal adhesion kinase 1
Synonyms:
FADK 1 FAK1 FLT4 Focal adhesion kinase (FAK) Focal adhesion kinase 1 (FAK) Focal adhesion kinase-related nonkinase PTK2 Protein-tyrosine kinase 2 p125FAK | pp125FAK
Type:
Tyrosine-protein kinase
Mol. Mass.:
119233.17
Organism:
Homo sapiens (Human)
Description:
Q05397
Residue:
1052
  
Inhibitor
Name:
BDBM50484315
Synonyms:
CHEMBL1834746
Type:
Small organic molecule
Emp. Form.:
C16H11ClN4O3S
Mol. Mass.:
374.802
SMILES:
Clc1ccc(cn1)C(=O)Nc1nnc(s1)-c1ccc2OCCOc2c1
: