Target
Casein kinase II subunit alpha'/beta
Ligand
BDBM50335638
Substrate
Meas. Tech.
ChEMBL_794696 (CHEMBL1937305)
Ki
0.220000±n/a nM
Citation
 Haddach, MPierre, FRegan, CFBorsan, CMichaux, JStefan, EKerdoncuff, PSchwaebe, MKChua, PCSiddiqui-Jain, AMacalino, DDrygin, DO'Brien, SERice, WGRyckman, DM Synthesis and SAR of inhibitors of protein kinase CK2: novel tricyclic quinoline analogs. Bioorg Med Chem Lett 22:45-8 (2012)  
Target
Name:
Casein kinase II subunit alpha'/beta
Synonyms:
Casein kinase II alpha''''/ beta Casein kinase II alpha'/ beta
Type:
Mol. Mass.:
Description:
ASSAY_ID of ChEMBL is 794696
Components:
This complex has 2 components.
Component 1
Name:
Casein kinase II subunit beta
Synonyms:
CK2N CSNK2B Casein kinase II subunit beta (CK2 beta) G5A | Serine/threonine-protein kinase pim-2
Type:
Enzyme
Mol. Mass.:
24937.13
Organism:
Homo sapiens (Human)
Description:
P67870
Residue:
215
  
Component 2
Name:
Casein kinase II subunit alpha'
Synonyms:
CK2A2 CSNK2A2 Casein kinase II alpha' Casein kinase II subunit alpha (CSNK2A2)
Type:
Protein
Mol. Mass.:
41223.82
Organism:
Homo sapiens (Human)
Description:
Residue:
350
  
Inhibitor
Name:
BDBM50335638
Synonyms:
5-(3-Chlorophenylamino)benzo[c][2,6]naphthyridine-8-carboxylic acid CHEMBL1230165 US9062043, Table 13, Compound 17 | US9062043, Table 20b, Compound 12
Type:
Small organic molecule
Emp. Form.:
C19H12ClN3O2
Mol. Mass.:
349.77
SMILES:
OC(=O)c1ccc2c(c1)nc(Nc1cccc(Cl)c1)c1ccncc21
: