Target
Serine/threonine-protein kinase B-raf
Ligand
BDBM50485033
Substrate
Meas. Tech.
ChEMBL_816296 (CHEMBL2026972)
IC50
0.400000±n/a nM
Citation
 Ren, LAhrendt, KAGrina, JLaird, ERBuckmelter, AJHansen, JDNewhouse, BMoreno, DWenglowsky, SDinkel, VGloor, SLHastings, GRana, SRasor, KRisom, TSturgis, HLVoegtli, WCMathieu, S The discovery of potent and selective pyridopyrimidin-7-one based inhibitors of B-RafV600E kinase. Bioorg Med Chem Lett 22:3387-91 (2012)  
Target
Name:
Serine/threonine-protein kinase B-raf
Synonyms:
B-RAF B-Raf proto-oncogene serine/threonine-protein kinase BRAF1 RAFB1 v-Raf murine sarcoma viral oncogene homolog B1
Type:
Serine/threonine-protein kinase
Mol. Mass.:
84446.00
Organism:
Homo sapiens (Human)
Description:
P15056
Residue:
766
  
Inhibitor
Name:
BDBM50485033
Synonyms:
CHEMBL2023502
Type:
Small organic molecule
Emp. Form.:
C21H21F2N7O3S
Mol. Mass.:
489.498
SMILES:
CCCS(=O)(=O)Nc1ccc(F)c(c1F)-c1cc2cnc(Nc3cnn(C)c3)nc2n(C)c1=O
: