Target
Polyphenol oxidase 2
Ligand
BDBM50485276
Substrate
Meas. Tech.
ChEMBL_827169 (CHEMBL2050453)
Ki
413±n/a nM
Citation
 Ha, YMPark, YJKim, JAPark, DPark, JYLee, HJLee, JYMoon, HRChung, HY Design and synthesis of 5-(substituted benzylidene)thiazolidine-2,4-dione derivatives as novel tyrosinase inhibitors. Eur J Med Chem 49:245-52 (2012)  
Target
Name:
Polyphenol oxidase 2
Synonyms:
Monophenol monooxygenase PPO2 Tyrosinase
Type:
Protein
Mol. Mass.:
63923.66
Organism:
Agaricus bisporus (Common mushroom)
Description:
O42713
Residue:
556
  
Inhibitor
Name:
BDBM50485276
Synonyms:
CHEMBL233375
Type:
Small organic molecule
Emp. Form.:
C11H9NO4S
Mol. Mass.:
251.258
SMILES:
COc1ccc(\C=C2/SC(=O)NC2=O)cc1O
: