Target
Solute carrier organic anion transporter family member 1B1
Ligand
BDBM50485551
Substrate
Meas. Tech.
ChEMBL_835935 (CHEMBL2077073)
IC50
1000±n/a nM
Citation
 Fehrenbach, TCui, YFaulstich, HKeppler, D Characterization of the transport of the bicyclic peptide phalloidin by human hepatic transport proteins. Naunyn Schmiedebergs Arch Pharmacol 368:415-20 (2003)  
Target
Name:
Solute carrier organic anion transporter family member 1B1
Synonyms:
LST1 OATP2 SLC21A6 SO1B1_HUMAN Solute carrier organic anion transporter family member 1B1 (OATP1B1) | Thromboxane B2
Type:
Protein
Mol. Mass.:
76468.06
Organism:
Homo sapiens (Human)
Description:
Q9Y6L6
Residue:
691
  
Inhibitor
Name:
BDBM50485551
Synonyms:
Antamanide
Type:
Small organic molecule
Emp. Form.:
C64H78N10O10
Mol. Mass.:
1147.3651
SMILES:
[H][C@@]12CCCN1C(=O)[C@]1([H])CCCN1C(=O)[C@@H](NC(=O)[C@@H](Cc1ccccc1)NC(=O)[C@H](Cc1ccccc1)NC(=O)[C@]1([H])CCCN1C(=O)[C@]1([H])CCCN1C(=O)[C@H](Cc1ccccc1)NC(=O)[C@@H](Cc1ccccc1)NC(=O)[C@H](C)NC2=O)C(C)C
: