Target
ATP-binding cassette sub-family C member 2
Ligand
BDBM50206509
Substrate
Meas. Tech.
ChEMBL_837935 (CHEMBL2075104)
Ki
42200±n/a nM
Citation
 Horikawa, MKato, YTyson, CASugiyama, Y The potential for an interaction between MRP2 (ABCC2) and various therapeutic agents: probenecid as a candidate inhibitor of the biliary excretion of irinotecan metabolites. Drug Metab Pharmacokinet 17:23-33 (2002)  
Target
Name:
ATP-binding cassette sub-family C member 2
Synonyms:
ABCC2 CMOAT CMRP Canalicular multispecific organic anion transporter 1 MRP2 Multidrug resistance-associated protein 2 Multidrug resistance-associated protein 3 (MRP3)
Type:
Protein
Mol. Mass.:
174229.45
Organism:
Homo sapiens (Human)
Description:
Q92887
Residue:
1545
  
Inhibitor
Name:
BDBM50206509
Synonyms:
4-Dipropylsulfamoyl-benzoic acid 4-Dipropylsulfamoyl-benzoic acid(probenecid) CHEMBL897 Probalan
Type:
Small organic molecule
Emp. Form.:
C13H19NO4S
Mol. Mass.:
285.359
SMILES:
CCCN(CCC)S(=O)(=O)c1ccc(cc1)C(O)=O
: