Target
Multidrug resistance-associated protein 1
Ligand
BDBM50390978
Substrate
Meas. Tech.
ChEMBL_837124 (CHEMBL2076525)
Ki
27000±n/a nM
Citation
 Leier, IJedlitschky, GBuchholz, UCole, SPDeeley, RGKeppler, D The MRP gene encodes an ATP-dependent export pump for leukotriene C4 and structurally related conjugates. J Biol Chem 269:27807-10 (1994) Target
Name:
Multidrug resistance-associated protein 1
Synonyms:
7.6.2.2 ABCC1 ATP-binding cassette, sub-family C, member 1 isoform 1 LTC4 transporter MRP MRP1_HUMAN
Type:
Mol. Mass.:
171597.72
Organism:
Homo sapiens (Human)
Description:
P33527
Residue:
1531
  
Inhibitor
Name:
BDBM50390978
Synonyms:
VALSPODAR
Type:
Small organic molecule
Emp. Form.:
C63H111N11O12
Mol. Mass.:
1214.6219
SMILES:
C\C=C\C[C@@H](C)C(=O)[C@@H]1N(C)C(=O)[C@H](C(C)C)N(C)C(=O)[C@H](CC(C)C)N(C)C(=O)[C@H](CC(C)C)N(C)C(=O)[C@@H](C)NC(=O)[C@H](C)NC(=O)[C@H](CC(C)C)N(C)C(=O)[C@@H](NC(=O)[C@H](CC(C)C)N(C)C(=O)CN(C)C(=O)[C@@H](NC1=O)C(C)C)C(C)C
: