Target
ATP-dependent translocase ABCB1
Ligand
BDBM50390991
Substrate
Meas. Tech.
ChEMBL_838276 (CHEMBL2076224)
Ki
117500±n/a nM
Citation
 Yasuda, KLan, LBSanglard, DFuruya, KSchuetz, JDSchuetz, EG Interaction of cytochrome P450 3A inhibitors with P-glycoprotein. J Pharmacol Exp Ther 303:323-32 (2002)  
Target
Name:
ATP-dependent translocase ABCB1
Synonyms:
Abcb1a MDR1A_MOUSE Mdr3 P-glycoprotein 1 and 3 (MDR1a/MDR1b) Pgy-3 | Pgy3
Type:
Protein
Mol. Mass.:
140669.02
Organism:
Mus musculus (Mouse)
Description:
P21447
Residue:
1276
  
Inhibitor
Name:
BDBM50390991
Synonyms:
ERGONOVINE
Type:
Small organic molecule
Emp. Form.:
C19H23N3O2
Mol. Mass.:
325.4048
SMILES:
C[C@@H](CO)NC(=O)[C@H]1CN(C)[C@@H]2Cc3c[nH]c4cccc(C2=C1)c34
: