Target
Solute carrier family 22 member 1
Ligand
BDBM25755
Substrate
Meas. Tech.
ChEMBL_838285 (CHEMBL2076233)
Ki
95800±n/a nM
Citation
 Zhang, LSchaner, MEGiacomini, KM Functional characterization of an organic cation transporter (hOCT1) in a transiently transfected human cell line (HeLa). J Pharmacol Exp Ther 286:354-61 (1998) Target
Name:
Solute carrier family 22 member 1
Synonyms:
Adrenergic Alpha Organic cation transporter 1 SLC22A1 hOCT1
Type:
Enzyme Catalytic Domain
Mol. Mass.:
61154.85
Organism:
Homo sapiens (Human)
Description:
Adrenergic Alpha 0 HUMAN::O15245
Residue:
554
  
Inhibitor
Name:
BDBM25755
Synonyms:
Acebutolol N-{3-acetyl-4-[2-hydroxy-3-(propan-2-ylamino)propoxy]phenyl}butanamide | Neptal
Type:
Small organic molecule
Emp. Form.:
C18H28N2O4
Mol. Mass.:
336.4259
SMILES:
CCCC(=O)Nc1ccc(OCC(O)CNC(C)C)c(c1)C(C)=O
: