Target
Genome polyprotein
Ligand
BDBM50486094
Substrate
Meas. Tech.
ChEMBL_885186 (CHEMBL2213720)
Ki
2.4±n/a nM
Citation
 Rudd, MTMcIntyre, CJRomano, JJButcher, JWHolloway, MKBush, KNguyen, KTGilbert, KFLyle, TALiverton, NJWan, BLSumma, VHarper, SRowley, MVacca, JPCarroll, SSBurlein, CDiMuzio, JMGates, AGraham, DJHuang, QLudmerer, SWMcClain, SMcHale, CStahlhut, MFandozzi, CTaylor, ATrainor, NOlsen, DBMcCauley, JA Development of macrocyclic inhibitors of HCV NS3/4A protease with cyclic constrained P2-P4 linkers. Bioorg Med Chem Lett 22:7207-13 (2012)  
Target
Name:
Genome polyprotein
Synonyms:
Genome polyprotein
Type:
PROTEIN
Mol. Mass.:
74061.95
Organism:
Hepacivirus C
Description:
ChEMBL_118425
Residue:
694
  
Inhibitor
Name:
BDBM50486094
Synonyms:
CHEMBL2203885
Type:
Small organic molecule
Emp. Form.:
C42H54N6O10S
Mol. Mass.:
834.977
SMILES:
[H][C@@]12CCN(C1)C(=O)N[C@@H](C1CCCCC1)C(=O)N1C[C@@]([H])(C[C@H]1C(=O)N[C@@]1(C[C@H]1C=C)C(=O)NS(=O)(=O)C1CC1)Oc1cc(OCC)nc3cc(OC)c(cc13)\C=C\CO2
: