Target
Alpha-1A adrenergic receptor
Ligand
BDBM50486328
Substrate
Meas. Tech.
ChEMBL_900820 (CHEMBL3049693)
Ki
0.050119±n/a nM
Citation
  TBA Med Chem Res 20:1455-1464 (2011)    Article 
Target
Name:
Alpha-1A adrenergic receptor
Synonyms:
ADA1A_HUMAN ADRA1C Alpha 1A-adrenoceptor Alpha adrenergic receptor 1a Alpha-adrenergic receptor 1c adrenergic Alpha1 | adrenergic Alpha1C
Type:
Cell-surface receptors
Mol. Mass.:
51511.67
Organism:
Homo sapiens (Human)
Description:
P35348
Residue:
466
  
Inhibitor
Name:
BDBM50486328
Synonyms:
CHEMBL2234441
Type:
Small organic molecule
Emp. Form.:
C25H27NO4
Mol. Mass.:
405.4862
SMILES:
COc1cccc(OC)c1OCCN[C@H]1C[C@@H](c2ccccc2)c2ccccc2O1
: