Target
Steroid 17-alpha-hydroxylase/17,20 lyase
Ligand
BDBM50029239
Substrate
Meas. Tech.
ChEMBL_50519 (CHEMBL661136)
IC50
88±n/a nM
Citation
 Rowlands, MGBarrie, SEChan, FHoughton, JJarman, MMcCague, RPotter, GA Esters of 3-pyridylacetic acid that combine potent inhibition of 17 alpha-hydroxylase/C17,20-lyase (cytochrome P45017 alpha) with resistance to esterase hydrolysis. J Med Chem 38:4191-7 (1995)  
Target
Name:
Steroid 17-alpha-hydroxylase/17,20 lyase
Synonyms:
CP17A_HUMAN CYP17A1 Cytochrome P450 17A1 Cytochrome P450 C17 (CYP17) Cytochrome P450-C17 P450-C17 Steroid 17-alpha-Monooxygenase (CYP17) Steroid 17-alpha-monooxygenase | cytochrome P450 monooxygenase 17 alpha hydroxylase/17,20-lyase (CYP17)
Type:
Enzyme
Mol. Mass.:
57382.42
Organism:
Homo sapiens (Human)
Description:
E.coli expressing human CYP17
Residue:
508
  
Inhibitor
Name:
BDBM50029239
Synonyms:
CHEMBL131984 | Pyridin-3-yl-acetic acid (S)-2,6,6-trimethyl-bicyclo[3.1.1]hept-3-yl ester
Type:
Small organic molecule
Emp. Form.:
C17H23NO2
Mol. Mass.:
273.37
SMILES:
C[C@H]1C2CC(CC1OC(=O)Cc1cccnc1)C2(C)C
: