Target
D(2) dopamine receptor
Ligand
BDBM50020240
Substrate
Meas. Tech.
ChEMBL_61763 (CHEMBL671129)
IC50
91.0±n/a nM
Citation
 Bøgesø, KPArnt, JFrederiksen, KHansen, HOHyttel, JPedersen, H Enhanced D1 affinity in a series of piperazine ring substituted 1-piperazino-3-arylindans with potential atypical antipsychotic activity. J Med Chem 38:4380-92 (1995)  
Target
Name:
D(2) dopamine receptor
Synonyms:
DOPAMINE D2 DOPAMINE D2 Short Dopamine D2 receptor Drd2
Type:
G Protein-Coupled Receptor (GPCR)
Mol. Mass.:
50931.60
Organism:
Rattus norvegicus (rat)
Description:
P61169
Residue:
444
  
Inhibitor
Name:
BDBM50020240
Synonyms:
1-[6-Fluoro-3-(4-fluoro-phenyl)-indan-1-yl]-4-methyl-piperazine CHEMBL307717
Type:
Small organic molecule
Emp. Form.:
C20H22F2N2
Mol. Mass.:
328.3989
SMILES:
CN1CCN(CC1)C1CC(c2ccc(F)cc12)c1ccc(F)cc1
: