Target
D(2) dopamine receptor
Ligand
BDBM50029369
Substrate
Meas. Tech.
ChEMBL_61763 (CHEMBL671129)
IC50
260±n/a nM
Citation
 Bøgesø, KPArnt, JFrederiksen, KHansen, HOHyttel, JPedersen, H Enhanced D1 affinity in a series of piperazine ring substituted 1-piperazino-3-arylindans with potential atypical antipsychotic activity. J Med Chem 38:4380-92 (1995)  
Target
Name:
D(2) dopamine receptor
Synonyms:
DOPAMINE D2 DOPAMINE D2 Short Dopamine D2 receptor Drd2
Type:
G Protein-Coupled Receptor (GPCR)
Mol. Mass.:
50931.60
Organism:
Rattus norvegicus (rat)
Description:
P61169
Residue:
444
  
Inhibitor
Name:
BDBM50029369
Synonyms:
4-(6-Chloro-3-phenyl-indan-1-yl)-1,2,2-trimethyl-piperazine | CHEMBL137960
Type:
Small organic molecule
Emp. Form.:
C22H27ClN2
Mol. Mass.:
354.916
SMILES:
CN1CCN(CC1(C)C)C1CC(c2ccc(Cl)cc12)c1ccccc1
: