Target
Coagulation factor X
Ligand
BDBM50029499
Substrate
Meas. Tech.
ChEMBL_48475 (CHEMBL663037)
IC50
860.0±n/a nM
Citation
 Shuman, RTRothenberger, RBCampbell, CSSmith, GFGifford-Moore, DSPaschal, JWGesellchen, PD Structure-activity study of tripeptide thrombin inhibitors using alpha-alkyl amino acids and other conformationally constrained amino acid substitutions. J Med Chem 38:4446-53 (1995)  
Target
Name:
Coagulation factor X
Synonyms:
Coagulation factor X FA10_BOVIN | Factor Xa (fXa)
Type:
PROTEIN
Mol. Mass.:
54498.45
Organism:
Bos taurus
Description:
ChEMBL_1364435
Residue:
492
  
Inhibitor
Name:
BDBM50029499
Synonyms:
CHEMBL141834 | tert-butyloxy carbonyl-D-Phe-thiazolidine-4-carboxylate-Arg-H
Type:
Small organic molecule
Emp. Form.:
C24H36N6O5S
Mol. Mass.:
520.645
SMILES:
CC(C)(C)OC(=O)N[C@@H](Cc1ccccc1)C(=O)N1CSCC1C(=O)N[C@@H](CCCNC(N)=N)C=O
: