Target
Tissue-type plasminogen activator
Ligand
BDBM50029515
Substrate
Meas. Tech.
ChEMBL_208051 (CHEMBL812493)
IC50
900±n/a nM
Citation
 Shuman, RTRothenberger, RBCampbell, CSSmith, GFGifford-Moore, DSPaschal, JWGesellchen, PD Structure-activity study of tripeptide thrombin inhibitors using alpha-alkyl amino acids and other conformationally constrained amino acid substitutions. J Med Chem 38:4446-53 (1995)  
Target
Name:
Tissue-type plasminogen activator
Synonyms:
Alteplase Reteplase Thrombin receptor protein Tissue-type plasminogen activator (tPA) t-PA t-plasminogen activator
Type:
Enzyme
Mol. Mass.:
62931.08
Organism:
Homo sapiens (Human)
Description:
Residue:
562
  
Inhibitor
Name:
BDBM50029515
Synonyms:
CHEMBL141584 | tert-butyloxy carbonyl-D-Phe-azetidine-2-carboxylate-Arg-H
Type:
Small organic molecule
Emp. Form.:
C24H36N6O6
Mol. Mass.:
504.5792
SMILES:
CC(C)(C)OC(=O)N[C@@H](Cc1ccccc1)C(=O)N1CC[C@H]1C(=O)N[C@@H](CCCNC(N)=N)C(O)=O
: