Target
Alpha-glucosidase MAL62
Ligand
BDBM50296247
Substrate
Meas. Tech.
ChEMBL_900261 (CHEMBL3068027)
IC50
48200±n/a nM
Citation
  TBA Med Chem Res 21:1762-1770 (2012)    Article 
Target
Name:
Alpha-glucosidase MAL62
Synonyms:
MAL62 MAL6S
Type:
PROTEIN
Mol. Mass.:
68174.43
Organism:
Saccharomyces cerevisiae
Description:
ChEMBL_942538
Residue:
584
  
Inhibitor
Name:
BDBM50296247
Synonyms:
3-(3,4-Dihydroxyphenyl)-N-[2-(5-hydroxyindol-3-yl)ethyl]-2-propenamide | CHEMBL559089
Type:
Small organic molecule
Emp. Form.:
C19H18N2O4
Mol. Mass.:
338.3572
SMILES:
Oc1ccc2[nH]cc(CCNC(=O)\C=C\c3ccc(O)c(O)c3)c2c1
: