Target
Alpha-glucosidase MAL62
Ligand
BDBM50341135
Substrate
Meas. Tech.
ChEMBL_900261 (CHEMBL3068027)
IC50
47200±n/a nM
Citation
  TBA Med Chem Res 21:1762-1770 (2012)    Article 
Target
Name:
Alpha-glucosidase MAL62
Synonyms:
MAL62 MAL6S
Type:
PROTEIN
Mol. Mass.:
68174.43
Organism:
Saccharomyces cerevisiae
Description:
ChEMBL_942538
Residue:
584
  
Inhibitor
Name:
BDBM50341135
Synonyms:
CHEMBL1760547 | N-p-Coumaroyl serotonin
Type:
Small organic molecule
Emp. Form.:
C19H18N2O3
Mol. Mass.:
322.3578
SMILES:
Oc1ccc(\C=C\C(=O)NCCc2c[nH]c3ccc(O)cc23)cc1
: