Target
Alpha-glucosidase MAL62
Ligand
BDBM50486693
Substrate
Meas. Tech.
ChEMBL_900261 (CHEMBL3068027)
IC50
>300000±n/a nM
Citation
  TBA Med Chem Res 21:1762-1770 (2012)    Article 
Target
Name:
Alpha-glucosidase MAL62
Synonyms:
MAL62 MAL6S
Type:
PROTEIN
Mol. Mass.:
68174.43
Organism:
Saccharomyces cerevisiae
Description:
ChEMBL_942538
Residue:
584
  
Inhibitor
Name:
BDBM50486693
Synonyms:
N-DIHYDROCAFFEOYL SEROTONIN
Type:
Small organic molecule
Emp. Form.:
C19H20N2O4
Mol. Mass.:
340.3731
SMILES:
Oc1ccc2[nH]cc(CCNC(=O)CCc3ccc(O)c(O)c3)c2c1
: