Target
Reverse transcriptase/RNaseH
Ligand
BDBM50004152
Substrate
Meas. Tech.
ChEMBL_195839 (CHEMBL799138)
IC50
>6000±n/a nM
Citation
 Dollé, VFan, ENguyen, CHAubertin, AMKirn, AAndreola, MLJamieson, GTarrago-Litvak, LBisagni, E A new series of pyridinone derivatives as potent non-nucleoside human immunodeficiency virus type 1 specific reverse transcriptase inhibitors. J Med Chem 38:4679-86 (1995)  
Target
Name:
Reverse transcriptase/RNaseH
Synonyms:
HIV-1 Reverse Transcriptase RNase H Reverse transcriptase/RNaseH
Type:
PROTEIN
Mol. Mass.:
65229.15
Organism:
Human immunodeficiency virus 1
Description:
ChEMBL_1473730
Residue:
566
  
Inhibitor
Name:
BDBM50004152
Synonyms:
(HEPT) 1-(2-Hydroxy-ethoxymethyl)-5-methyl-6-phenylsulfanyl-1H-pyrimidine-2,4-dione 1-(2-HYDROXYETHYLOXYMETHYL)-6-PHENYL THIOTHYMINE 1-(2-Hydroxy-ethoxymethyl)-5-methyl-6-phenylsulfanyl-1H-pyrimidine-2,4-dione(HEPT) 1-[(2-hydroxyethoxy)methyl]-6-(phenylthio)-thymine | CHEMBL31871
Type:
Small organic molecule
Emp. Form.:
C14H16N2O4S
Mol. Mass.:
308.353
SMILES:
Cc1c(Sc2ccccc2)n(COCCO)c(=O)[nH]c1=O
: