Target
Retinoic acid receptor alpha
Ligand
BDBM31883
Substrate
Meas. Tech.
ChEMBL_195197 (CHEMBL798387)
EC50
7±n/a nM
Citation
 Johnson, ATKlein, ESGillett, SJWang, LSong, TKPino, MEChandraratna, RA Synthesis and characterization of a highly potent and effective antagonist of retinoic acid receptors. J Med Chem 38:4764-7 (1996)  
Target
Name:
Retinoic acid receptor alpha
Synonyms:
NR1B1 RAR-alpha RARA_HUMAN Retinoic acid receptor alpha/Retinoid X receptor alpha Retinoid receptor
Type:
PROTEIN
Mol. Mass.:
50778.87
Organism:
Homo sapiens (Human)
Description:
ChEMBL_1466191
Residue:
462
  
Inhibitor
Name:
BDBM31883
Synonyms:
9-cis-retinoic acid (9cRA) AT-RA CHEMBL38 SMR000058245 Vitamin A acid [3H]Retinoic acid [3H]tretinoin cid_444795
Type:
radiolabeled ligand
Emp. Form.:
C20H28O2
Mol. Mass.:
300.4351
SMILES:
C\C(\C=C\C1=C(C)CCCC1(C)C)=C/C=C/C(/C)=C/C(O)=O
: