Target
Prostaglandin G/H synthase 2
Ligand
BDBM50486824
Substrate
Meas. Tech.
ChEMBL_901624 (CHEMBL3062030)
Kd
227±n/a nM
Citation
  TBA Med Chem Res 21:3491-3498 (2012)    Article 
Target
Name:
Prostaglandin G/H synthase 2
Synonyms:
COX2 Cyclooxygenase 2 (COX-2) Cyclooxygenase-2 (COX-2 AA) Cyclooxygenase-2 (COX-2) PGH2_HUMAN PHS II Prostaglandin E synthase/G/H synthase 2 Prostaglandin-endoperoxide synthase 2
Type:
Enzyme
Mol. Mass.:
69003.89
Organism:
Homo sapiens (Human)
Description:
Recombinant Cox-2 provided by Cayman (Cayman Chemical Co.,Ann Arbor, MI).
Residue:
604
  
Inhibitor
Name:
BDBM50486824
Synonyms:
CHEMBL2235864
Type:
Small organic molecule
Emp. Form.:
C10H9N3O4
Mol. Mass.:
235.1962
SMILES:
CCOC(=O)c1nc2ccccn2c1[N+]([O-])=O
: