Target
cAMP-specific 3',5'-cyclic phosphodiesterase 4B
Ligand
BDBM50029957
Substrate
Meas. Tech.
ChEMBL_157198 (CHEMBL768611)
Ki
338±n/a nM
Citation
 Brackeen, MFCowan, DJStafford, JASchoenen, FJVeal, JMDomanico, PLRose, DStrickland, ABVerghese, MFeldman, PL Design and synthesis of conformationally constrained analogues of 4-(3-butoxy-4-methoxybenzyl)imidazolidin-2-one (Ro 20-1724) as potent inhibitors of cAMP-specific phosphodiesterase. J Med Chem 38:4848-54 (1996)  
Target
Name:
cAMP-specific 3',5'-cyclic phosphodiesterase 4B
Synonyms:
3',5'-cyclic phosphodiesterase Isoform PDE4B1 PDE4B PDE4B_HUMAN Phosphodiesterase 4B (PDE4B) Phosphodiesterase Type 4 (PDE4B)
Type:
Protein
Mol. Mass.:
83318.87
Organism:
Homo sapiens (Human)
Description:
Q07343
Residue:
736
  
Inhibitor
Name:
BDBM50029957
Synonyms:
(7R,7aS)-7-(3-Cyclopentyloxy-4-methoxy-phenyl)-hexahydro-pyrrolizin-3-one | CHEMBL343244
Type:
Small organic molecule
Emp. Form.:
C19H25NO3
Mol. Mass.:
315.4067
SMILES:
COc1ccc(cc1OC1CCCC1)[C@H]1CCN2[C@H]1CCC2=O
: