Target
Alpha-glucosidase MAL62
Ligand
BDBM26658
Substrate
Meas. Tech.
ChEMBL_903251 (CHEMBL3047160)
IC50
39994474976±n/a nM
Citation
  TBA Med Chem Res 21:3984-3993 (2012)    Article 
Target
Name:
Alpha-glucosidase MAL62
Synonyms:
MAL62 MAL6S
Type:
PROTEIN
Mol. Mass.:
68174.43
Organism:
Saccharomyces cerevisiae
Description:
ChEMBL_942538
Residue:
584
  
Inhibitor
Name:
BDBM26658
Synonyms:
2-(2,4-dihydroxyphenyl)-3,5,7-trihydroxy-1-benzopyran-4-one 2-(2,4-dihydroxyphenyl)-3,5,7-trihydroxy-chromone 2-[2,4-bis(oxidanyl)phenyl]-3,5,7-tris(oxidanyl)chromen-4-one MLS000069618 Morin (5) SMR000058259 morin
Type:
Flavonoid
Emp. Form.:
C15H10O7
Mol. Mass.:
302.2357
SMILES:
Oc1ccc(c(O)c1)-c1oc2cc(O)cc(O)c2c(=O)c1O
: