Target
Gag-Pol polyprotein [489-587]
Ligand
BDBM50030220
Substrate
Meas. Tech.
ChEMBL_195687 (CHEMBL800604)
IC50
60±n/a nM
Citation
 Mohan, PLoya, SAvidan, OVerma, SDhindsa, GSWong, MFHuang, PPYashiro, MBaba, MHizi, A Synthesis of naphthalenesulfonic acid small molecules as selective inhibitors of the DNA polymerase and ribonuclease H activities of HIV-1 reverse transcriptase. J Med Chem 37:2513-9 (1994)  
Target
Name:
Gag-Pol polyprotein [489-587]
Synonyms:
Human immunodeficiency virus type 1 protease Pol polyprotein | gag-pol
Type:
Enzyme Subunit
Mol. Mass.:
10781.16
Organism:
Human immunodeficiency virus type 1
Description:
P04585[489-587]
Residue:
99
  
Inhibitor
Name:
BDBM50030220
Synonyms:
4-[(10R,13R)-17-(1,5-Dimethyl-hexyl)-10,13-dimethyl-2,3,4,7,8,9,10,11,12,13,14,15,16,17-tetradecahydro-1H-cyclopenta[a]phenanthren-3-yloxycarbonylamino]-5-hydroxy-naphthalene-2,7-disulfonic acid | CHEMBL312014
Type:
Small organic molecule
Emp. Form.:
C38H53NO9S2
Mol. Mass.:
731.959
SMILES:
CC(C)CCCC(C)C1CCC2C3CC=C4CC(CC[C@]4(C)C3CC[C@]12C)OC(=O)Nc1cc(cc2cc(cc(O)c12)S(O)(=O)=O)S(O)(=O)=O
: