Target
Acetolactate synthase, chloroplastic
Ligand
BDBM50424586
Substrate
Meas. Tech.
ChEMBL_908493 (CHEMBL3068012)
Ki
253±n/a nM
Citation
 McCourt, JAPang, SSKing-Scott, JGuddat, LWDuggleby, RG Herbicide-binding sites revealed in the structure of plant acetohydroxyacid synthase. Proc Natl Acad Sci U S A 103:569-73 (2006)  
Target
Name:
Acetolactate synthase, chloroplastic
Synonyms:
AHAS Acetolactate synthase ILVB_ARATH | TZP5
Type:
PROTEIN
Mol. Mass.:
72585.19
Organism:
Arabidopsis thaliana
Description:
ChEMBL_934103
Residue:
670
  
Inhibitor
Name:
BDBM50424586
Synonyms:
CHEMBL1229780 | Tribenuron Methyl
Type:
Small organic molecule
Emp. Form.:
C15H17N5O6S
Mol. Mass.:
395.39
SMILES:
COC(=O)c1ccccc1S(=O)(=O)NC(=O)N(C)c1nc(C)nc(OC)n1
: