Target
Peptidylglycine alpha-amidating monooxygenase
Ligand
BDBM50030357
Substrate
Meas. Tech.
ChEMBL_154488 (CHEMBL765265)
IC50
15±n/a nM
Citation
 Erion, MDTan, JWong, MJeng, AY Inhibition of peptidylglycine alpha-amidating monooxygenase by N-substituted homocysteine analogs. J Med Chem 37:4430-7 (1995)  
Target
Name:
Peptidylglycine alpha-amidating monooxygenase
Synonyms:
AMD_RAT Peptidyl-glycine alpha-amidating monooxygenase
Type:
PROTEIN
Mol. Mass.:
108665.78
Organism:
Rattus norvegicus
Description:
ChEMBL_536304
Residue:
976
  
Inhibitor
Name:
BDBM50030357
Synonyms:
4-Mercapto-2-[(S)-3-phenyl-2-(3-phenyl-propionylamino)-propionylamino]-butyric acid | CHEMBL344578
Type:
Small organic molecule
Emp. Form.:
C22H26N2O4S
Mol. Mass.:
414.518
SMILES:
OC(=O)C(CCS)NC(=O)[C@H](Cc1ccccc1)NC(=O)CCc1ccccc1
: