Target
4-hydroxy-3-methylbut-2-enyl diphosphate reductase
Ligand
BDBM50165342
Substrate
Meas. Tech.
ChEMBL_908690 (CHEMBL3065755)
IC50
540000±n/a nM
Citation
 Wang, KWang, WNo, JHZhang, YZhang, YOldfield, E Inhibition of the Fe(4)S(4)-cluster-containing protein IspH (LytB): electron paramagnetic resonance, metallacycles, and mechanisms. J Am Chem Soc 132:6719-27 (2010)  
Target
Name:
4-hydroxy-3-methylbut-2-enyl diphosphate reductase
Synonyms:
(E)-1-hydroxy-2-methyl-but-2-enyl 4-diphosphate reductase (IspH) ispH | lytB
Type:
Enzyme
Mol. Mass.:
32103.05
Organism:
Aquifex aeolicus
Description:
O67625
Residue:
289
  
Inhibitor
Name:
BDBM50165342
Synonyms:
CHEMBL193356 | hydrogen 1-hydroxy-2-(3-methylpyridinium-1-yl)-1-phosphonoethylphosphonate
Type:
Small organic molecule
Emp. Form.:
C8H13NO7P2
Mol. Mass.:
297.1388
SMILES:
Cc1ccc[n+](CC(O)(P(O)(O)=O)P(O)([O-])=O)c1
: