Target
4-hydroxy-3-methylbut-2-enyl diphosphate reductase
Ligand
BDBM50373099
Substrate
Meas. Tech.
ChEMBL_908690 (CHEMBL3065755)
IC50
>1000000±n/a nM
Citation
 Wang, KWang, WNo, JHZhang, YZhang, YOldfield, E Inhibition of the Fe(4)S(4)-cluster-containing protein IspH (LytB): electron paramagnetic resonance, metallacycles, and mechanisms. J Am Chem Soc 132:6719-27 (2010)  
Target
Name:
4-hydroxy-3-methylbut-2-enyl diphosphate reductase
Synonyms:
(E)-1-hydroxy-2-methyl-but-2-enyl 4-diphosphate reductase (IspH) ispH | lytB
Type:
Enzyme
Mol. Mass.:
32103.05
Organism:
Aquifex aeolicus
Description:
O67625
Residue:
289
  
Inhibitor
Name:
BDBM50373099
Synonyms:
CHEMBL99553 | NE-10575
Type:
Small organic molecule
Emp. Form.:
C8H14NO7P2
Mol. Mass.:
298.1462
SMILES:
C[n+]1cccc(CC(O)(P(O)(O)=O)P(O)(O)=O)c1
: