Target
4-hydroxy-3-methylbut-2-enyl diphosphate reductase
Ligand
BDBM50487150
Substrate
Meas. Tech.
ChEMBL_908690 (CHEMBL3065755)
Ki
60±n/a nM
Citation
 Wang, KWang, WNo, JHZhang, YZhang, YOldfield, E Inhibition of the Fe(4)S(4)-cluster-containing protein IspH (LytB): electron paramagnetic resonance, metallacycles, and mechanisms. J Am Chem Soc 132:6719-27 (2010)  
Target
Name:
4-hydroxy-3-methylbut-2-enyl diphosphate reductase
Synonyms:
(E)-1-hydroxy-2-methyl-but-2-enyl 4-diphosphate reductase (IspH) ispH | lytB
Type:
Enzyme
Mol. Mass.:
32103.05
Organism:
Aquifex aeolicus
Description:
O67625
Residue:
289
  
Inhibitor
Name:
BDBM50487150
Synonyms:
BUT-3-YNYL DIPHOSPHATE
Type:
Small organic molecule
Emp. Form.:
C4H8O7P2
Mol. Mass.:
230.0496
SMILES:
OP(O)(=O)OP(O)(=O)OCCC#C
: