Target
Acetylcholine-binding protein
Ligand
BDBM50487234
Substrate
Meas. Tech.
ChEMBL_908842 (CHEMBL3067864)
Ki
80±n/a nM
Citation
 Tomizawa, MCasida, JE Unique neonicotinoid binding conformations conferring selective receptor interactions. J Agric Food Chem 59:2825-8 (2011)  
Target
Name:
Acetylcholine-binding protein
Synonyms:
ACHP_LYMST Acetylcholine Binding protein Acetylcholine-binding protein (Ls-AchBP) | AchBP
Type:
Mol. Mass.:
26055.52
Organism:
Lymnaea stagnalis
Description:
Soluble acetylcholine receptor
Residue:
229
  
Inhibitor
Name:
BDBM50487234
Synonyms:
CHEMBL1391421
Type:
Small organic molecule
Emp. Form.:
C10H11ClN4O2
Mol. Mass.:
254.673
SMILES:
[O-][N+](=O)\C=C1/NCCN1Cc1ccc(Cl)nc1
: