Target
Alpha-1B adrenergic receptor
Ligand
BDBM50487287
Substrate
Meas. Tech.
ChEMBL_911257 (CHEMBL3056397)
Ki
0.208930±n/a nM
Citation
  TBA Med Chem Res 13:190-199 (2004)    Article 
Target
Name:
Alpha-1B adrenergic receptor
Synonyms:
ADA1B_RAT Alpha 1B-adrenoceptor Alpha adrenergic receptor 1A and 1B Alpha-1Adrenoceptor Alpha-1B adrenoreceptor | adrenergic Alpha1B
Type:
G Protein-Coupled Receptor (GPCR)
Mol. Mass.:
56606.71
Organism:
Rattus norvegicus (rat)
Description:
Receptor binding assays were performed using rat cortical membranes.
Residue:
515
  
Inhibitor
Name:
BDBM50487287
Synonyms:
(+)-CYCLAZOSIN
Type:
Small organic molecule
Emp. Form.:
C23H27N5O4
Mol. Mass.:
437.4916
SMILES:
COc1cc2nc(nc(N)c2cc1OC)N1CCN([C@H]2CCCC[C@H]12)C(=O)c1ccco1
: