Target
Polyunsaturated fatty acid 5-lipoxygenase
Ligand
BDBM50031142
Substrate
Meas. Tech.
ChEMBL_89911 (CHEMBL702329)
IC50
50±n/a nM
Citation
 Crawley, GCBriggs, MT Chiral dioxolane inhibitors of leukotriene biosynthesis: structure-activity relationships and syntheses using asymmetric dihydroxylation. J Med Chem 38:3951-6 (1995)  
Target
Name:
Polyunsaturated fatty acid 5-lipoxygenase
Synonyms:
5-LO 5-Lipoxygenase (5-LO) 5-Lipoygenase ALOX5 LOG5 | LOX5_HUMAN
Type:
Enzyme
Mol. Mass.:
77972.74
Organism:
Homo sapiens (Human)
Description:
Recombinant protein was purified from E. coli lysate. After ammonium sulfate precipitation and subsequent steps, the supernatant (S100) was used for 5-LO activity assay.
Residue:
674
  
Inhibitor
Name:
BDBM50031142
Synonyms:
CHEMBL129448 | [1-{4-[4-((S)-2,2,4-Trimethyl-[1,3]dioxolan-4-yl)-thiophene-2-sulfonyl]-phenyl}-eth-(E)-ylideneaminooxy]-acetonitrile
Type:
Small organic molecule
Emp. Form.:
C20H22N2O5S2
Mol. Mass.:
434.529
SMILES:
C\C(=N/OCC#N)c1ccc(cc1)S(=O)(=O)c1cc(cs1)[C@@]1(C)COC(C)(C)O1
: