Target
Geranylgeranyl transferase type-1 subunit beta/Protein farnesyltransferase/geranylgeranyltransferase type-1 subunit alpha
Ligand
BDBM50031163
Substrate
Meas. Tech.
ChEMBL_71810 (CHEMBL683641)
IC50
100±n/a nM
Citation
 deSolms, SJDeana, AAGiuliani, EAGraham, SLKohl, NEMosser, SDOliff, AIPompliano, DLRands, EScholz, TH Pseudodipeptide inhibitors of protein farnesyltransferase. J Med Chem 38:3967-71 (1995)  
Target
Name:
Geranylgeranyl transferase type-1 subunit beta/Protein farnesyltransferase/geranylgeranyltransferase type-1 subunit alpha
Synonyms:
Geranylgeranyl Transferase (GGTase-I) Geranylgeranyl transferase type I
Type:
Protein Complex
Mol. Mass.:
Description:
Components:
This complex has 2 components.
Component 1
Name:
Protein farnesyltransferase/geranylgeranyltransferase type-1 subunit alpha
Synonyms:
CAAX farnesyltransferase alpha subunit FNTA_BOVIN GGTase-I-alpha Protein Farnesyltransferase (PFT) Chain A Protein farnesyltransferase/geranylgeranyltransferase type I alpha subunit Type I protein geranyl-geranyltransferase alpha subunit
Type:
Enzyme
Mol. Mass.:
43827.38
Organism:
Bos taurus (bovine)
Description:
The enzyme was purified from a bovine brain homogenate by sequential ammonium sulfate fractionation and affinity chromatography.
Residue:
375
  
Component 2
Name:
Geranylgeranyl transferase type-1 subunit beta
Synonyms:
GGTase-I-beta Geranylgeranyl transferase type-1 subunit beta PGTB1_BOVIN | Type I protein geranyl-geranyltransferase subunit beta
Type:
Enzyme
Mol. Mass.:
42483.88
Organism:
Bos taurus (bovine)
Description:
Purified from bovine brain
Residue:
377
  
Inhibitor
Name:
BDBM50031163
Synonyms:
(S)-2-((R)-2-Amino-3-mercapto-propylamino)-3-methyl-pentanoic acid (3-methyl-butyl)-amide | CHEMBL129109
Type:
Small organic molecule
Emp. Form.:
C14H31N3OS
Mol. Mass.:
289.48
SMILES:
CCC(C)[C@H](NC[C@@H](N)CS)C(=O)NCCC(C)C
: