Target
Aldo-keto reductase family 1 member B1
Ligand
BDBM50487374
Substrate
Meas. Tech.
ChEMBL_911330 (CHEMBL3056339)
IC50
130±n/a nM
Citation
  TBA Med Chem Res 17:258-266 (2008)    Article 
Target
Name:
Aldo-keto reductase family 1 member B1
Synonyms:
AKR1B1 ALDR_HUMAN AR Aldose Reductase (ALR2) Aldose reductase (AR)
Type:
Protein
Mol. Mass.:
35855.50
Organism:
Homo sapiens (Human)
Description:
P15121. 4LAU; 2IKI; 4LB4; 2FZD; 2FZ8; 1US0
Residue:
316
  
Inhibitor
Name:
BDBM50487374
Synonyms:
CHEMBL2260162
Type:
Small organic molecule
Emp. Form.:
C12H8N2O6S
Mol. Mass.:
308.267
SMILES:
OC(=O)CN1C(=O)S\C(=C\c2cccc(c2)[N+]([O-])=O)C1=O
: