Target
Proteinase-activated receptor 1
Ligand
BDBM50031392
Substrate
Meas. Tech.
ChEMBL_209245 (CHEMBL814872)
EC50
200±n/a nM
Citation
 Feng, DMVeber, DFConnolly, TMCondra, CTang, MJNutt, RF Development of a potent thrombin receptor ligand. J Med Chem 38:4125-30 (1995)  
Target
Name:
Proteinase-activated receptor 1
Synonyms:
CF2R F2R PAR1 Proteinase activated receptor 1 TR Thrombin receptor/ Proteinase-activated receptor 1(Par-1)
Type:
Protein
Mol. Mass.:
47450.07
Organism:
Homo sapiens (Human)
Description:
P25116
Residue:
425
  
Inhibitor
Name:
BDBM50031392
Synonyms:
(S)-2-[(S)-2-((S)-2-{(S)-2-[(S)-2-((S)-2-Amino-3-hydroxy-propionylamino)-3-phenyl-propionylamino]-4-methyl-pentanoylamino}-4-methyl-pentanoylamino)-5-guanidino-pentanoylamino]-succinamide CHEMBL33473
Type:
Small organic molecule
Emp. Form.:
C34H57N11O8
Mol. Mass.:
747.8853
SMILES:
CC(C)C[C@H](NC(=O)[C@H](CC(C)C)NC(=O)[C@H](Cc1ccccc1)NC(=O)[C@@H](N)CO)C(=O)N[C@@H](CCCNC(N)=N)C(=O)N[C@@H](CC(N)=O)C(N)=O
: