Target
Aromatase
Ligand
BDBM50031435
Substrate
Meas. Tech.
ChEMBL_50550 (CHEMBL660328)
IC50
530±n/a nM
Citation
 Liu, XPLambert, DMAbul-Hajj, YJ Probing the hydrophobic pocket of the active site of aromatase with 4-phenoxy-7 alpha-(phenylthio)-4-androstene-3,17-dione. J Med Chem 38:4135-8 (1995)  
Target
Name:
Aromatase
Synonyms:
ARO1 CP19A_HUMAN CYP19 CYPXIX Cytochrome P450 19A1 Cytochrome P450-C19 (CYP19) FL cytokine receptor precursor | P-450AROM
Type:
Enzyme
Mol. Mass.:
57888.92
Organism:
Homo sapiens (Human)
Description:
P11511
Residue:
503
  
Inhibitor
Name:
BDBM50031435
Synonyms:
10,13-Dimethyl-4-phenoxy-1,6,7,8,9,10,11,12,13,14,15,16-dodecahydro-2H-cyclopenta[a]phenanthrene-3,17-dione | CHEMBL334391
Type:
Small organic molecule
Emp. Form.:
C25H30O3
Mol. Mass.:
378.5039
SMILES:
CC12CCC3C(CCC4=C(Oc5ccccc5)C(=O)CCC34C)C1CCC2=O
: