Target
Steroid 17-alpha-hydroxylase/17,20 lyase
Ligand
BDBM50031667
Substrate
Meas. Tech.
ChEMBL_50394 (CHEMBL662850)
IC50
5.6±n/a nM
Citation
 Potter, GABarrie, SEJarman, MRowlands, MG Novel steroidal inhibitors of human cytochrome P45017 alpha (17 alpha-hydroxylase-C17,20-lyase): potential agents for the treatment of prostatic cancer. J Med Chem 38:2463-71 (1995)  
Target
Name:
Steroid 17-alpha-hydroxylase/17,20 lyase
Synonyms:
CP17A_HUMAN CYP17A1 Cytochrome P450 17A1 Cytochrome P450 C17 (CYP17) Cytochrome P450-C17 P450-C17 Steroid 17-alpha-Monooxygenase (CYP17) Steroid 17-alpha-monooxygenase | cytochrome P450 monooxygenase 17 alpha hydroxylase/17,20-lyase (CYP17)
Type:
Enzyme
Mol. Mass.:
57382.42
Organism:
Homo sapiens (Human)
Description:
E.coli expressing human CYP17
Residue:
508
  
Inhibitor
Name:
BDBM50031667
Synonyms:
3-((10R,13S)-10,13-Dimethyl-2,7,8,9,10,11,12,13,14,15-decahydro-1H-cyclopenta[a]phenanthren-17-yl)-pyridine | CHEMBL310315
Type:
Small organic molecule
Emp. Form.:
C24H29N
Mol. Mass.:
331.4938
SMILES:
C[C@]12CCC3C(CC=C4C=CCC[C@]34C)C1CC=C2c1cccnc1
: