Target
Glutamate receptor ionotropic, NMDA 2C
Ligand
BDBM50031704
Substrate
Meas. Tech.
ChEMBL_140698 (CHEMBL751689)
IC50
>7000±n/a nM
Citation
 Gu, ZQHesson, DPPelletier, JCMaccecchini, MLZhou, LMSkolnick, P Synthesis, resolution, and biological evaluation of the four stereoisomers of 4-methylglutamic acid: selective probes of kainate receptors. J Med Chem 38:2518-20 (1995)  
Target
Name:
Glutamate receptor ionotropic, NMDA 2C
Synonyms:
Glutamate NMDA receptor; Grin1/Grin2c Grin2c NMDE3_RAT
Type:
Protein
Mol. Mass.:
135305.94
Organism:
Rattus norvegicus (Rat)
Description:
Q00961
Residue:
1237
  
Inhibitor
Name:
BDBM50031704
Synonyms:
(2S,4R)-2-Amino-4-methyl-pentanedioic acid (2S,4R)-4-methylglutamic acid CHEMBL288166
Type:
Small organic molecule
Emp. Form.:
C6H11NO4
Mol. Mass.:
161.1558
SMILES:
C[C@H](C[C@H](N)C(O)=O)C(O)=O
: