Target
Aryl hydrocarbon receptor
Ligand
BDBM23941
Substrate
Meas. Tech.
ChEMBL_909259 (CHEMBL3056575)
Ki
12±n/a nM
Citation
  TBA Med Chem Res 19:864-901 (2010)    Article 
Target
Name:
Aryl hydrocarbon receptor
Synonyms:
AHR BHLHE76 aryl hydrocarbon receptor precursor
Type:
PROTEIN
Mol. Mass.:
96143.77
Organism:
Homo sapiens (Human)
Description:
ChEMBL_1503828
Residue:
848
  
Inhibitor
Name:
BDBM23941
Synonyms:
1,3-dichloro-5-[(Z)-2-(4-chlorophenyl)ethenyl]benzene | cis-Stilbene Derivative, 5b
Type:
Small organic molecule
Emp. Form.:
C14H9Cl3
Mol. Mass.:
283.58
SMILES:
Clc1ccc(\C=C/c2cc(Cl)cc(Cl)c2)cc1
: