Target
Acetylcholinesterase
Ligand
BDBM50004000
Substrate
Meas. Tech.
ChEMBL_28142 (CHEMBL644926)
IC50
19±n/a nM
Citation
 Villalobos, AButler, TWChapin, DSChen, YLDeMattos, SBIves, JLJones, SBListon, DRNagel, AANason, DM 5,7-dihydro-3-[2-[1-(phenylmethyl)-4-piperidinyl]ethyl]-6H- pyrrolo[3,2-f]-1,2-benzisoxazol-6-one: a potent and centrally-selective inhibitor of acetylcholinesterase with an improved margin of safety. J Med Chem 38:2802-8 (1995)  
Target
Name:
Acetylcholinesterase
Synonyms:
ACES_HUMAN Acetylcholinesterase (AChE) | Acetylcholinesterase (human AChE)
Type:
Enzyme
Mol. Mass.:
67792.70
Organism:
Homo sapiens (Human)
Description:
P22303
Residue:
614
  
Inhibitor
Name:
BDBM50004000
Synonyms:
(3aS,8aR)-1,3a,8-trimethyl-1,2,3,3a,8,8a-hexahydropyrrolo[2,3-b]indol-5-yl methylcarbamate CHEMBL94 Physostol | physostigmine
Type:
Small organic molecule
Emp. Form.:
C15H21N3O2
Mol. Mass.:
275.3461
SMILES:
CNC(=O)Oc1ccc2N(C)[C@H]3N(C)CC[C@@]3(C)c2c1
: